BDBM304973 3-(3-((4,4-dioxido-1,4,5-oxathiazepan-5-yl)methyl)-4-methylphenyl)-3-(7-methoxy-1-methyl-1H-benzo[d][1,2,3]triazol-5-yl)propanoic acid::US10144731, Example 59
SMILES COc1cc(cc2nnn(C)c12)C(CC(O)=O)c1ccc(C)c(CN2CCOCCS2(=O)=O)c1
InChI Key InChIKey=DLUHYYWDKTVUNT-UHFFFAOYSA-N
Data  1 IC50
  Tab Delimited (TSV)   2D SDfile   Computed 3D by Vconf -m prep SDfile
Find this compound or compounds like it in BindingDB:
Activity Spreadsheet -- Enzyme Inhibition Constant Data from BindingDB
Found 1 hit for monomerid = 304973
TargetKelch-like ECH-associated protein 1 [321-609](Homo sapiens (Human))
Glaxosmithkline
US Patent
LigandPNGBDBM304973(3-(3-((4,4-dioxido-1,4,5-oxathiazepan-5-yl)methyl)...)
Affinity DataIC50:  55nM. Assay description: 100 nL of 100× compound dose response curves (serial 3-fold dilutions) in DMSO are stamped using an Echo liquid handling system (Labcyte) into 384-we...
Ligand InfoPC cidPC sid
In DepthDetails US Patent