BDBM30615 US8853258, 303
SMILES CC(CCc1ccc(OCc2cccnc2)cc1)(C(=O)NO)S(C)(=O)=O
InChI Key InChIKey=DUKANYHAEIZUED-UHFFFAOYSA-N
Data  1 IC50
  Tab Delimited (TSV)   2D SDfile   Computed 3D by Vconf -m prep SDfile
Find this compound or compounds like it in BindingDB:
Activity Spreadsheet -- Enzyme Inhibition Constant Data from BindingDB
Found 1 hit for monomerid = 30615
TargetUDP-3-O-acyl-N-acetylglucosamine deacetylase(Pseudomonas aeruginosa)
Pfizer
US Patent
LigandPNGBDBM30615(US8853258, 303)
Affinity DataIC50:  4.58nMpH: 8.0Assay Description:IC50 determination in the LpxC enzyme assay was carried out in a similar manner to that described by Malikzay et al in the 2006 Poster, Screening Lpx...
In DepthDetails US Patent