BDBM306718 N-(2-(3,5-difluoro-4-((1R,3R)-2-(2-fluoro-2-methylpropyl)-3-methyl-2,3,4,9-tetrahydro-1H-pyrido[3,4-b]indol-1-yl)phenoxy)ethyl)-3-fluoropropan-1-amine::US10149839, Example 4
SMILES C[C@@H]1Cc2c([nH]c3ccccc23)[C@H](N1CC(C)(C)F)c1c(F)cc(OCCNCCCF)cc1F
InChI Key
Data  2 IC50
  Tab Delimited (TSV)   2D SDfile   Computed 3D by Vconf -m prep SDfile
Find this compound or compounds like it in BindingDB:
Activity Spreadsheet -- Enzyme Inhibition Constant Data from BindingDB
Found 2 hits for monomerid = 306718
TargetEstrogen receptor(Homo sapiens (Human))
Astrazeneca
US Patent
LigandPNGBDBM306718(N-(2-(3,5-difluoro-4-((1R,3R)-2-(2-fluoro-2-methyl...)
Affinity DataIC50:  0.0800nM. Assay description: The ability of compounds to down-regulate Estrogen Receptor (ER) numbers was assessed in a cell based immuno-fluorescence assay using the MCF-7 human...
Ligand InfoPC cidPC sid
In DepthDetails US Patent
TargetEstrogen receptor(Homo sapiens (Human))
Astrazeneca
US Patent
LigandPNGBDBM306718(N-(2-(3,5-difluoro-4-((1R,3R)-2-(2-fluoro-2-methyl...)
Affinity DataIC50:  0.200nM. Assay description: Compounds were dosed directly from a compound source microplate containing serially diluted compound (4 wells containing 10 mM, 0.1 mM, 1 mM and 10 n...
Ligand InfoPC cidPC sid
In DepthDetails US Patent