BDBM30689 1-(4-fluorophenyl)-4-isoindolin-2-yl-butan-1-one;hydrochloride::4-(1,3-Dihydro-isoindol-2-yl)-1-(4-fluoro-phenyl)-butan-1-one::4-(1,3-dihydroisoindol-2-yl)-1-(4-fluorophenyl)-1-butanone;hydrochloride::4-(1,3-dihydroisoindol-2-yl)-1-(4-fluorophenyl)butan-1-one;hydrochloride::MLS000070620::SMR000011656::cid_6603184
SMILES Fc1ccc(cc1)C(=O)CCCN1Cc2ccccc2C1
InChI Key InChIKey=KBAKFQWFCALQPM-UHFFFAOYSA-N
Data  1 EC50
  Tab Delimited (TSV)   2D SDfile   Computed 3D by Vconf -m prep SDfile
Find this compound or compounds like it in BindingDB:
Activity Spreadsheet -- Enzyme Inhibition Constant Data from BindingDB
Found 1 hit for monomerid = 30689
Target5-hydroxytryptamine receptor 1A(Homo sapiens (Human))
The Scripps Research Institute Molecular Screening Center
Curated by PubChem BioAssay
LigandPNGBDBM30689(1-(4-fluorophenyl)-4-isoindolin-2-yl-butan-1-one;h...)
Affinity DataEC50:  9.90E+4nMpH: 7.4 T: 2°C. Assay description: A cell line containing the human 5-HT1a receptor, the promiscuous G-alpha-15 protein (Ga15) as well as the beta-lactamase (BLA) reporter-gene under c...
In DepthDetails PCBioAssay