BDBM30706 DIHYDROERGOCRISTINE MESYLATE::MLS000069354::SMR000058240::cid_444034
SMILES CS(O)(=O)=O.[H][C@@]12CCCN1C(=O)[C@H](Cc1ccccc1)N1C(=O)[C@](NC(=O)[C@H]3CN(C)[C@]4([H])Cc5c[nH]c6cccc(c56)[C@@]4([H])C3)(O[C@@]21O)C(C)C
InChI Key InChIKey=SPXACGZWWVIDGR-SPZWACKZSA-N
Data  1 EC50
  Tab Delimited (TSV)   2D SDfile   Computed 3D by Vconf -m prep SDfile
Find this compound or compounds like it in BindingDB:
Activity Spreadsheet -- Enzyme Inhibition Constant Data from BindingDB
Found 1 hit for monomerid = 30706
Target5-hydroxytryptamine receptor 1A(Homo sapiens (Human))
The Scripps Research Institute Molecular Screening Center
Curated by PubChem BioAssay
LigandPNGBDBM30706(DIHYDROERGOCRISTINE MESYLATE | MLS000069354 | SMR0...)
Affinity DataEC50:  9.90E+4nMpH: 7.4 T: 2°C. Assay description: A cell line containing the human 5-HT1a receptor, the promiscuous G-alpha-15 protein (Ga15) as well as the beta-lactamase (BLA) reporter-gene under c...
In DepthDetails PCBioAssay