BDBM307498 US10150728, Example I-741::US10233156, Example I-208
SMILES C[C@@H](CO[C@H]1CC[C@@H](CC1)Oc1nc2c(F)cc(OCC(F)F)c(F)c2n1C)NC(C)=O
InChI Key InChIKey=DZCQRBLSFXXSBP-UBHSHLNASA-N
Data  2 IC50
  Tab Delimited (TSV)   2D SDfile   Computed 3D by Vconf -m prep SDfile
Find this compound or compounds like it in BindingDB:
Activity Spreadsheet -- Enzyme Inhibition Constant Data from BindingDB
Found 2 hits for monomerid = 307498
TargetAcetyl-CoA carboxylase 2(Homo sapiens (Human))
Shionogi
US Patent
LigandPNGBDBM307498(US10150728, Example I-741 | US10233156, Example I-...)
Affinity DataIC50:  8.70nM. Assay description: Recombinant human ACC1 and recombinant human ACC2, which were prepared by the method mentioned above, were preincubated with assay buffer solution (5...
Ligand InfoPC cidPC sid
In DepthDetails US Patent
TargetAcetyl-CoA carboxylase 2(Homo sapiens (Human))
Shionogi
US Patent
LigandPNGBDBM307498(US10150728, Example I-741 | US10233156, Example I-...)
Affinity DataIC50:  7nM. Assay description: Recombinant human ACC1 and recombinant human ACC2, which were prepared by the method mentioned above, were preincubated with assay buffer solution (5...
Ligand InfoPC cidPC sid
In DepthDetails US Patent