BDBM307527 (R)-1-(3-(4-((2-amino-4-((S)-1-hydroxyhexan-3-ylamino)-6-methylpyrimidin-5-yl)methyl)-3-methoxyphenoxy)propyl)pyrrolidine-2-carboxylic acid::US10150743, Example 8::US10562861, Ex. No. 8
SMILES CCC[C@@H](CCO)Nc1nc(N)nc(C)c1Cc1ccc(OCCCN2CCC[C@@H]2C(O)=O)cc1OC
InChI Key InChIKey=RAOIMTPEPSLKEC-NZQKXSOJSA-N
Data  1 IC50  4 EC50
  Tab Delimited (TSV)   2D SDfile   Computed 3D by Vconf -m prep SDfile
Find this compound or compounds like it in BindingDB:
Activity Spreadsheet -- Enzyme Inhibition Constant Data from BindingDB
Found 5 hits for monomerid = 307527
TargetToll-like receptor 7(Homo sapiens (Human))
Sumitomo Dainippon Pharma
US Patent
LigandPNGBDBM307527((R)-1-(3-(4-((2-amino-4-((S)-1-hydroxyhexan-3-ylam...)
Affinity DataEC50:  6.90E+3nM. Assay description: Recombinant human TLR7 was stably expressed in a HEK293 cell line already stably expressing the pNiFty2-SEAP reporter plasmid; integration of the rep...
Ligand InfoPC cidPC sid
In DepthDetails US Patent
TargetToll-like receptor 8(Homo sapiens (Human))
Sumitomo Dainippon Pharma
US Patent
LigandPNGBDBM307527((R)-1-(3-(4-((2-amino-4-((S)-1-hydroxyhexan-3-ylam...)
Affinity DataEC50: <1.00E+4nM. Assay description: TLR8/NF-kB/SEAPorter HEK 293 Cell Line (Imgenex Corporation) is a stably co-transfected cell line which expresses full-length human TLR8 and the secr...
Ligand InfoPC cidPC sid
In DepthDetails US Patent
TargetPotassium voltage-gated channel subfamily H member 2(Homo sapiens (Human))
Sumitomo Dainippon Pharma
US Patent
LigandPNGBDBM307527((R)-1-(3-(4-((2-amino-4-((S)-1-hydroxyhexan-3-ylam...)
Affinity DataIC50: >1.00E+4nM. Assay description: The hERG potassium current was measured in a hERG-stably-expressing Chinese hamster ovary K1 (CHO) cells. The experiments were performed using an aut...
Ligand InfoPC cidPC sid
In DepthDetails US Patent
TargetToll-like receptor 8(Homo sapiens (Human))
Sumitomo Dainippon Pharma
US Patent
LigandPNGBDBM307527((R)-1-(3-(4-((2-amino-4-((S)-1-hydroxyhexan-3-ylam...)
Affinity DataEC50: >1.00E+4nM. Assay description: TLR8/NF-kB/SEAPorter™ HEK 293 Cell Line (Imgenex Corporation) is a stably co-transfected cell line which expresses full-length human TLR8 and the sec...
Ligand InfoPC cidPC sid
In DepthDetails US Patent
TargetToll-like receptor 7(Homo sapiens (Human))
Sumitomo Dainippon Pharma
US Patent
LigandPNGBDBM307527((R)-1-(3-(4-((2-amino-4-((S)-1-hydroxyhexan-3-ylam...)
Affinity DataEC50:  126nM. Assay description: Recombinant human TLR7 was stably expressed in a HEK293 cell line already stably expressing the pNiFty2-SEAP reporter plasmid; integration of the rep...
Ligand InfoPC cidPC sid
In DepthDetails US Patent