BDBM307595 US10150751, Example 33
SMILES CCOC(=O)c1c(OC)ccnc1N[C@@H]1C[C@@H](C)N(C1)C(=O)c1ccccc1-n1nccn1
InChI Key InChIKey=QWOAKCZCEMFZPK-HZPDHXFCSA-N
Data  2 IC50
  Tab Delimited (TSV)   2D SDfile   Computed 3D by Vconf -m prep SDfile
Find this compound or compounds like it in BindingDB:
Activity Spreadsheet -- Enzyme Inhibition Constant Data from BindingDB
Found 2 hits for monomerid = 307595
TargetOrexin/Hypocretin receptor type 1(Homo sapiens (Human))
Merck Sharp & Dohme
US Patent
LigandPNGBDBM307595(US10150751, Example 33)
Affinity DataIC50:  4.07E+3nM. Assay description:  All reagents were from GIBCO-Invitrogen Corp. The seeded plates are incubated overnight at 37° C. and 5% CO2. Ala-6,12 human orexin-A as the agonist...
Ligand InfoPC cidPC sid
In DepthDetails US Patent
TargetOrexin receptor type 2(Homo sapiens (Human))
Merck Sharp & Dohme
US Patent
LigandPNGBDBM307595(US10150751, Example 33)
Affinity DataIC50:  31.1nM. Assay description:  All reagents were from GIBCO-Invitrogen Corp. The seeded plates are incubated overnight at 37° C. and 5% CO2. Ala-6,12 human orexin-A as the agonist...
Ligand InfoPC cidPC sid
In DepthDetails US Patent