BDBM307652 2-(6-(4-cyclopropyl- 4H-1,2,4-triazol-3- yl)pyridin-2-yl)-6- (2-methylpyrimidin- 5-yl)isoindolin-1- one::US10150755, Compound 44
SMILES Cc1ncc(cn1)-c1ccc2CN(C(=O)c2c1)c1cccc(n1)-c1nncn1C1CC1
InChI Key InChIKey=JRDPEWFIYFHVBI-UHFFFAOYSA-N
Data  1 KI  3 IC50
  Tab Delimited (TSV)   2D SDfile   Computed 3D by Vconf -m prep SDfile
Find this compound or compounds like it in BindingDB:
Activity Spreadsheet -- Enzyme Inhibition Constant Data from BindingDB
Found 4 hits for monomerid = 307652
TargetMitogen-activated protein kinase kinase kinase 5(Homo sapiens (Human))
Seal Rock Therapeutics
US Patent
LigandPNGBDBM307652(2-(6-(4-cyclopropyl- 4H-1,2,4-triazol-3- yl)pyridi...)
Affinity DataKi: <200nM. Assay description: The ASK1 enzymatic assay was run following Promega ASK1 Kinase Enzyme System (Cat #V3881). The kit provides the protocol, enzymes and all reagents ne...
Ligand InfoPC cidPC sid
In DepthDetails US Patent
TargetMitogen-activated protein kinase kinase kinase 5(Homo sapiens (Human))
Seal Rock Therapeutics
US Patent
LigandPNGBDBM307652(2-(6-(4-cyclopropyl- 4H-1,2,4-triazol-3- yl)pyridi...)
Affinity DataIC50: <200nM. Assay description: The ASK1 enzymatic assay was run following Promega ASK1 Kinase Enzyme System (Cat #V3881). The kit provides the protocol, enzymes and all reagents ne...
Ligand InfoPC cidPC sid
In DepthDetails US Patent
TargetTumor necrosis factor(Homo sapiens (Human))
Seal Rock Therapeutics
US Patent
LigandPNGBDBM307652(2-(6-(4-cyclopropyl- 4H-1,2,4-triazol-3- yl)pyridi...)
Affinity DataIC50:  6.00E+3nM. Assay description: Cryopreserved human PBMCs were obtained from AllCells (cat# PB003F). After thawing/dilution protocols using RPMI medium supplemented with 5% FBS (hea...
Ligand InfoPC cidPC sid
In DepthDetails US Patent
TargetTumor necrosis factor(Homo sapiens (Human))
Seal Rock Therapeutics
US Patent
LigandPNGBDBM307652(2-(6-(4-cyclopropyl- 4H-1,2,4-triazol-3- yl)pyridi...)
Affinity DataIC50:  600nM. Assay description: Cryopreserved human PBMCs were obtained from AllCells (cat# PB003F). After thawing/dilution protocols using RPMI medium supplemented with 5% FBS (hea...
Ligand InfoPC cidPC sid
In DepthDetails US Patent