BDBM307703 US9650336, Example 6
SMILES CC1(C)COc2ccc(cc2C11C=C(F)C(N)=N1)-c1cncnc1
InChI Key InChIKey=DQSDTWNNUBVZJC-UHFFFAOYSA-N
Data  1 IC50
  Tab Delimited (TSV)   2D SDfile   Computed 3D by Vconf -m prep SDfile
Find this compound or compounds like it in BindingDB:
Activity Spreadsheet -- Enzyme Inhibition Constant Data from BindingDB
Found 1 hit for monomerid = 307703
TargetBeta-secretase 1 [1-460](Homo sapiens (Human))
Astrazeneca
US Patent
LigandPNGBDBM307703(US9650336, Example 6)
Affinity DataIC50:  770nM. Assay description: The cDNA for the soluble part of the human 13-Secretase (AA 1-AA 460) was cloned using the ASP2-Fc10-1-IRES-GFP-neoK mammalian expression vector. The...
Ligand InfoPC cidPC sid
In DepthDetails US Patent