BDBM30773 (2S)-2-(butan-2-ylcarbamoylamino)-3-phenyl-propanoic acid::(2S)-2-(butan-2-ylcarbamoylamino)-3-phenylpropanoic acid::(2S)-2-[[(butan-2-ylamino)-oxomethyl]amino]-3-phenylpropanoic acid::(2S)-3-phenyl-2-(sec-butylcarbamoylamino)propionic acid::MLS000083221::SMR000045328::cid_664326
SMILES CCC(C)NC(=O)N[C@@H](Cc1ccccc1)C(O)=O
InChI Key InChIKey=POENHGXBLDTBGN-KFJBMODSSA-N
Data  1 EC50
  Tab Delimited (TSV)   2D SDfile   Computed 3D by Vconf -m prep SDfile
Find this compound or compounds like it in BindingDB:
Activity Spreadsheet -- Enzyme Inhibition Constant Data from BindingDB
Found 1 hit for monomerid = 30773
Target5-hydroxytryptamine receptor 1A(Homo sapiens (Human))
The Scripps Research Institute Molecular Screening Center
Curated by PubChem BioAssay
LigandPNGBDBM30773((2S)-2-(butan-2-ylcarbamoylamino)-3-phenyl-propano...)
Affinity DataEC50:  9.90E+4nMpH: 7.4 T: 2°C. Assay description: A cell line containing the human 5-HT1a receptor, the promiscuous G-alpha-15 protein (Ga15) as well as the beta-lactamase (BLA) reporter-gene under c...
In DepthDetails PCBioAssay