BDBM308046 (S)-1-(1H- benzo[d]imidazol-5-yl)-5-(4- propoxyphenyl)imidazolidin- 2-one::US9650362, 14
SMILES CCCOc1ccc(cc1)[C@H]1CNC(=O)N1c1ccc2[nH]cnc2c1
InChI Key
Data  1 KI  1 IC50
  Tab Delimited (TSV)   2D SDfile   Computed 3D by Vconf -m prep SDfile
Find this compound or compounds like it in BindingDB:
Activity Spreadsheet -- Enzyme Inhibition Constant Data from BindingDB
Found 2 hits for monomerid = 308046
TargetGlutaminyl-peptide cyclotransferase(Homo sapiens (Human))
Probiodrug
US Patent
LigandPNGBDBM308046((S)-1-(1H- benzo[d]imidazol-5-yl)-5-(4- propoxyphe...)
Affinity DataKi:  37.4nM. Assay description: All measurements were performed with a BioAssay Reader HTS-7000Plus for microplates (Perkin Elmer) at 30° C. QC activity was evaluated fluorometrical...
In DepthDetails US Patent
TargetGlutaminyl-peptide cyclotransferase(Homo sapiens (Human))
Probiodrug
US Patent
LigandPNGBDBM308046((S)-1-(1H- benzo[d]imidazol-5-yl)-5-(4- propoxyphe...)
Affinity DataIC50:  238nM. Assay description: All measurements were performed with a BioAssay Reader HTS-7000Plus for microplates (Perkin Elmer) at 30° C. QC activity was evaluated fluorometrical...
In DepthDetails US Patent