BDBM308047 (S)-1-(1H-1,3-benzodiazol- 5-yl)-5-(4- biphenyl)imidazolidin- 2-one::US9650362, 43
SMILES O=C1NC[C@@H](N1c1ccc2[nH]cnc2c1)c1ccc(cc1)-c1ccccc1
InChI Key
Data  1 KI  1 IC50
  Tab Delimited (TSV)   2D SDfile   Computed 3D by Vconf -m prep SDfile
Find this compound or compounds like it in BindingDB:
Activity Spreadsheet -- Enzyme Inhibition Constant Data from BindingDB
Found 2 hits for monomerid = 308047
TargetGlutaminyl-peptide cyclotransferase(Homo sapiens (Human))
Probiodrug
US Patent
LigandPNGBDBM308047((S)-1-(1H-1,3-benzodiazol- 5-yl)-5-(4- biphenyl)im...)
Affinity DataKi:  40.8nM. Assay description: All measurements were performed with a BioAssay Reader HTS-7000Plus for microplates (Perkin Elmer) at 30° C. QC activity was evaluated fluorometrical...
Ligand InfoPC cidPC sid
In DepthDetails US Patent
TargetGlutaminyl-peptide cyclotransferase(Homo sapiens (Human))
Probiodrug
US Patent
LigandPNGBDBM308047((S)-1-(1H-1,3-benzodiazol- 5-yl)-5-(4- biphenyl)im...)
Affinity DataIC50:  254nM. Assay description: All measurements were performed with a BioAssay Reader HTS-7000Plus for microplates (Perkin Elmer) at 30° C. QC activity was evaluated fluorometrical...
Ligand InfoPC cidPC sid
In DepthDetails US Patent