BDBM308084 US9649309, Compound UNC2585A
SMILES CCCCNc1ncc(C(=O)NCc2ccc(OC)cc2OC)c(N[C@H]2CC[C@H](O)CC2)n1
InChI Key InChIKey=NQFQOWLMRBYVBZ-IYARVYRRSA-N
Data  5 IC50
  Tab Delimited (TSV)   2D SDfile   Computed 3D by Vconf -m prep SDfile
Find this compound or compounds like it in BindingDB:
Activity Spreadsheet -- Enzyme Inhibition Constant Data from BindingDB
Found 5 hits for monomerid = 308084
TargetReceptor-type tyrosine-protein kinase FLT3(Homo sapiens (Human))
University Of North Carolina At Chapel Hill
US Patent
LigandPNGBDBM308084(US9649309, Compound UNC2585A)
Affinity DataIC50:  585nM. Assay description: Briefly, activity assays were performed in a 384 well, polypropylene microplate in a final volume of 50 μL of 50 mM Hepes, Ph 7.4 containing 10 ...
Ligand InfoPC cidPC sid
In DepthDetails US Patent
TargetTyrosine-protein kinase Mer(Homo sapiens (Human))
University Of North Carolina At Chapel Hill
US Patent
LigandPNGBDBM308084(US9649309, Compound UNC2585A)
Affinity DataIC50:  21nM. Assay description: Briefly, activity assays were performed in a 384 well, polypropylene microplate in a final volume of 50 μL of 50 mM Hepes, Ph 7.4 containing 10 ...
Ligand InfoPC cidPC sid
In DepthDetails US Patent
TargetTyrosine-protein kinase Mer(Homo sapiens (Human))
University Of North Carolina At Chapel Hill
US Patent
LigandPNGBDBM308084(US9649309, Compound UNC2585A)
Affinity DataIC50:  55nM. Assay description: Briefly, activity assays were performed in a 384 well, polypropylene microplate in a final volume of 50 μL of 50 mM Hepes, Ph 7.4 containing 10 ...
Ligand InfoPC cidPC sid
In DepthDetails US Patent
TargetTyrosine-protein kinase receptor TYRO3(Homo sapiens (Human))
University Of North Carolina At Chapel Hill
US Patent
LigandPNGBDBM308084(US9649309, Compound UNC2585A)
Affinity DataIC50:  2.82E+3nM. Assay description: Briefly, activity assays were performed in a 384 well, polypropylene microplate in a final volume of 50 μL of 50 mM Hepes, Ph 7.4 containing 10 ...
Ligand InfoPC cidPC sid
In DepthDetails US Patent
TargetGrowth arrest-specific protein 6(Homo sapiens (Human))
University Of North Carolina At Chapel Hill
US Patent
LigandPNGBDBM308084(US9649309, Compound UNC2585A)
Affinity DataIC50:  1.10E+3nM. Assay description: Briefly, activity assays were performed in a 384 well, polypropylene microplate in a final volume of 50 μL of 50 mM Hepes, Ph 7.4 containing 10 ...
Ligand InfoPC cidPC sid
In DepthDetails US Patent