BDBM308345 US9649309, Compound UNC4110A
SMILES CCCCNc1ncc(c(NC2CCC(O)CC2)n1)-c1ccc(CN2CCNCC2(C)C)cn1
InChI Key InChIKey=XGWKKUQOFQDOKM-UHFFFAOYSA-N
Data  3 IC50
  Tab Delimited (TSV)   2D SDfile   Computed 3D by Vconf -m prep SDfile
Find this compound or compounds like it in BindingDB:
Activity Spreadsheet -- Enzyme Inhibition Constant Data from BindingDB
Found 3 hits for monomerid = 308345
TargetTyrosine-protein kinase Mer(Homo sapiens (Human))
University Of North Carolina At Chapel Hill
US Patent
LigandPNGBDBM308345(US9649309, Compound UNC4110A)
Affinity DataIC50:  2.30nM. Assay description: Briefly, activity assays were performed in a 384 well, polypropylene microplate in a final volume of 50 μL of 50 mM Hepes, Ph 7.4 containing 10 ...
Ligand InfoPC cidPC sid
In DepthDetails US Patent
TargetReceptor-type tyrosine-protein kinase FLT3(Homo sapiens (Human))
University Of North Carolina At Chapel Hill
US Patent
LigandPNGBDBM308345(US9649309, Compound UNC4110A)
Affinity DataIC50:  4.5nM. Assay description: Briefly, activity assays were performed in a 384 well, polypropylene microplate in a final volume of 50 μL of 50 mM Hepes, Ph 7.4 containing 10 ...
Ligand InfoPC cidPC sid
In DepthDetails US Patent
TargetGrowth arrest-specific protein 6(Homo sapiens (Human))
University Of North Carolina At Chapel Hill
US Patent
LigandPNGBDBM308345(US9649309, Compound UNC4110A)
Affinity DataIC50:  19nM. Assay description: Briefly, activity assays were performed in a 384 well, polypropylene microplate in a final volume of 50 μL of 50 mM Hepes, Ph 7.4 containing 10 ...
Ligand InfoPC cidPC sid
In DepthDetails US Patent