BDBM308495 US9655879, 31
SMILES Cl.CC(C)(Cc1ccc(s1)C(=O)Oc1ccc(cc1F)C(N)=N)C(=O)Nc1ccc(cc1)C(O)=O
InChI Key InChIKey=QWJBPYHICUEKBK-UHFFFAOYSA-N
Data  2 KI
  Tab Delimited (TSV)   2D SDfile   Computed 3D by Vconf -m prep SDfile
Find this compound or compounds like it in BindingDB:
Activity Spreadsheet -- Enzyme Inhibition Constant Data from BindingDB
Found 2 hits for monomerid = 308495
TargetEnteropeptidase(Homo sapiens (Human))
Ea Pharma
US Patent
LigandPNGBDBM308495(US9655879, 31)
Affinity DataKi:  1.08nM. Assay description: Using a 96 well plate (#3915, Costar), a test compound (25 μL) was mixed with 20 μM fluorescence enzyme substrate (Boc-Phe-Ser-Arg-AMC, 50 ...
Ligand InfoPC cidPC sid
In DepthDetails US Patent
TargetSerine protease 1(Homo sapiens (Human))
Ea Pharma
US Patent
LigandPNGBDBM308495(US9655879, 31)
Affinity DataKi:  2.89nM. Assay description: Using a 96 well plate (#3915, Costar), a test compound (25 μL), 400 mM Tris-HCl buffer (pH 8.0, 25 μL) and 0.5 mg/mL fluorescence enzyme su...
Ligand InfoPC cidPC sid
In DepthDetails US Patent