BDBM30871 1,4-dioxa-8-azaspiro[4.5]decan-8-yl-[2-methyl-1-(3-methylphenyl)-5-benzimidazolyl]methanone::1,4-dioxa-8-azaspiro[4.5]decan-8-yl-[2-methyl-1-(3-methylphenyl)benzimidazol-5-yl]methanone::1,4-dioxa-8-azaspiro[4.5]decan-8-yl-[2-methyl-1-(m-tolyl)benzimidazol-5-yl]methanone::8-{[2-methyl-1-(3-methylphenyl)-1H-benzimidazol-5-yl]carbonyl}-1,4-dioxa-8-azaspiro[4.5]decane::MLS000095931::SMR000031479::cid_3241342
SMILES Cc1nc2cc(ccc2n1-c1cccc(C)c1)C(=O)N1CCC2(CC1)OCCO2
InChI Key InChIKey=NPPNSFNYOKPSKR-UHFFFAOYSA-N
Data  1 EC50
  Tab Delimited (TSV)   2D SDfile   Computed 3D by Vconf -m prep SDfile
Find this compound or compounds like it in BindingDB:
Activity Spreadsheet -- Enzyme Inhibition Constant Data from BindingDB
Found 1 hit for monomerid = 30871
Target5-hydroxytryptamine receptor 1A(Homo sapiens (Human))
The Scripps Research Institute Molecular Screening Center
Curated by PubChem BioAssay
LigandPNGBDBM30871(1,4-dioxa-8-azaspiro[4.5]decan-8-yl-[2-methyl-1-(3...)
Affinity DataEC50:  9.90E+4nMpH: 7.4 T: 2°C. Assay description: A cell line containing the human 5-HT1a receptor, the promiscuous G-alpha-15 protein (Ga15) as well as the beta-lactamase (BLA) reporter-gene under c...
In DepthDetails PCBioAssay