BDBM30877 1-[[2-(3-chlorophenyl)-5-methyl-1,3-oxazol-4-yl]methyl]-N-(3-morpholin-4-ylpropyl)piperidine-3-carboxamide::1-[[2-(3-chlorophenyl)-5-methyl-4-oxazolyl]methyl]-N-[3-(4-morpholinyl)propyl]-3-piperidinecarboxamide::1-[[2-(3-chlorophenyl)-5-methyl-oxazol-4-yl]methyl]-N-(3-morpholinopropyl)nipecotamide::1-{[2-(3-chlorophenyl)-5-methyl-1,3-oxazol-4-yl]methyl}-N-(3-morpholin-4-ylpropyl)piperidine-3-carboxamide::MLS000089348::SMR000027723::cid_3242062
SMILES Cc1oc(nc1CN1CCCC(C1)C(=O)NCCCN1CCOCC1)-c1cccc(Cl)c1
InChI Key InChIKey=UFURVUSIFJQYLT-UHFFFAOYSA-N
Data  1 EC50
  Tab Delimited (TSV)   2D SDfile   Computed 3D by Vconf -m prep SDfile
Find this compound or compounds like it in BindingDB:
Activity Spreadsheet -- Enzyme Inhibition Constant Data from BindingDB
Found 1 hit for monomerid = 30877
Target5-hydroxytryptamine receptor 1A(Homo sapiens (Human))
The Scripps Research Institute Molecular Screening Center
Curated by PubChem BioAssay
LigandPNGBDBM30877(1-[[2-(3-chlorophenyl)-5-methyl-1,3-oxazol-4-yl]me...)
Affinity DataEC50:  9.90E+4nMpH: 7.4 T: 2°C. Assay description: A cell line containing the human 5-HT1a receptor, the promiscuous G-alpha-15 protein (Ga15) as well as the beta-lactamase (BLA) reporter-gene under c...
In DepthDetails PCBioAssay