BDBM309341 (S)-2-acetamido-N-(4-(4-(4-fluorophenoxy)phenyl)pyridine-2-yl)-3-(1-methyl-1H-imidazol-4-yl)propanamide::US9656959, Example 24
SMILES CS(=O)(=O)Nc1cc(cc(n1)-c1ccc(Oc2ccc(F)cc2)cc1)[C@H](O)CO
InChI Key InChIKey=UWXNTZDOXDLPJE-LJQANCHMSA-N
Data  1 IC50
  Tab Delimited (TSV)   2D SDfile   Computed 3D by Vconf -m prep SDfile
Find this compound or compounds like it in BindingDB:
Activity Spreadsheet -- Enzyme Inhibition Constant Data from BindingDB
Found 1 hit for monomerid = 309341
TargetSodium channel protein type 9 subunit alpha(Homo sapiens (Human))
Purdue Pharma
US Patent
LigandPNGBDBM309341((S)-2-acetamido-N-(4-(4-(4-fluorophenoxy)phenyl)py...)
Affinity DataIC50:  2.90E+3nM. Assay description: In vitro assays were performed in a recombinant cell line expressing cDNA encoding the alpha subunit (Nav1.7, SCN9a, PN1, NE) of human Nav1.7 (Access...
Ligand InfoPC cidPC sid
In DepthDetails US Patent