BDBM309359 1-(4-chloro-6-(4-(4-fluorophenoxy)phenyl)pyridin-2-yl)piperidine-4-carboxylic acid::US9656959, Example 53
SMILES OC(=O)C1CCN(CC1)c1cc(Cl)cc(n1)-c1ccc(Oc2ccc(F)cc2)cc1
InChI Key InChIKey=AGYNSCSHRXXELX-UHFFFAOYSA-N
Data  1 IC50
  Tab Delimited (TSV)   2D SDfile   Computed 3D by Vconf -m prep SDfile
Find this compound or compounds like it in BindingDB:
Activity Spreadsheet -- Enzyme Inhibition Constant Data from BindingDB
Found 1 hit for monomerid = 309359
TargetSodium channel protein type 9 subunit alpha(Homo sapiens (Human))
Purdue Pharma
US Patent
LigandPNGBDBM309359(1-(4-chloro-6-(4-(4-fluorophenoxy)phenyl)pyridin-2...)
Affinity DataIC50:  7.34E+3nM. Assay description: In vitro assays were performed in a recombinant cell line expressing cDNA encoding the alpha subunit (Nav1.7, SCN9a, PN1, NE) of human Nav1.7 (Access...
Ligand InfoPC cidPC sid
In DepthDetails US Patent