BDBM309392 (S)-N-(6-(4-(4-fluorophenoxy)phenyl)pyridin-2-yl)-2-(2-hydroxyacetamido)-4-methylpentanamide::US9656959, Example 90
SMILES CC(C)C[C@H](NC(=O)CO)C(=O)Nc1cccc(n1)-c1ccc(Oc2ccc(F)cc2)cc1
InChI Key InChIKey=SHCWQWWMYJJYLP-QFIPXVFZSA-N
Data  1 IC50
  Tab Delimited (TSV)   2D SDfile   Computed 3D by Vconf -m prep SDfile
Find this compound or compounds like it in BindingDB:
Activity Spreadsheet -- Enzyme Inhibition Constant Data from BindingDB
Found 1 hit for monomerid = 309392
TargetSodium channel protein type 9 subunit alpha(Homo sapiens (Human))
Purdue Pharma
US Patent
LigandPNGBDBM309392((S)-N-(6-(4-(4-fluorophenoxy)phenyl)pyridin-2-yl)-...)
Affinity DataIC50:  70nM. Assay description: In vitro assays were performed in a recombinant cell line expressing cDNA encoding the alpha subunit (Nav1.7, SCN9a, PN1, NE) of human Nav1.7 (Access...
Ligand InfoPC cidPC sid
In DepthDetails US Patent