BDBM309401 (S)-2-(3-(6-(4-(4-fluorophenoxy)phenyl)pyridin-2-yl)ureido)-3-(1-methyl-1H-imidazol-4-yl)propanamide::US9656959, Example 99
SMILES Cn1cnc(C[C@H](NC(=O)Nc2cccc(n2)-c2ccc(Oc3ccc(F)cc3)cc2)C(N)=O)c1
InChI Key InChIKey=IZKNOSJIYNTZHT-QFIPXVFZSA-N
Data  1 IC50
  Tab Delimited (TSV)   2D SDfile   Computed 3D by Vconf -m prep SDfile
Find this compound or compounds like it in BindingDB:
Activity Spreadsheet -- Enzyme Inhibition Constant Data from BindingDB
Found 1 hit for monomerid = 309401
TargetSodium channel protein type 9 subunit alpha(Homo sapiens (Human))
Purdue Pharma
US Patent
LigandPNGBDBM309401((S)-2-(3-(6-(4-(4-fluorophenoxy)phenyl)pyridin-2-y...)
Affinity DataIC50:  667nM. Assay description: In vitro assays were performed in a recombinant cell line expressing cDNA encoding the alpha subunit (Nav1.7, SCN9a, PN1, NE) of human Nav1.7 (Access...
Ligand InfoPC cidPC sid
In DepthDetails US Patent