BDBM309434 (2R,3aS,4R,9bS)-12-(cyclopropylmethyl)- N-(4-fluorobenzyl)-3a,8-dihydroxy- 1,2,3,3a,4,5-hexahydro-4,9b-(epimino- ethano)cyclopenta[a]naphthalene-2- carboxamide::US9656962, Compound 48
SMILES Oc1ccc2C[C@H]3N(CC4CC4)CC[C@@]4(C[C@H](C[C@@]34O)C(=O)NCc3ccc(F)cc3)c2c1
InChI Key InChIKey=SAZYSHYLLQGZMH-RXTZQXTGSA-N
Data  1 EC50
  Tab Delimited (TSV)   2D SDfile   Computed 3D by Vconf -m prep SDfile
Find this compound or compounds like it in BindingDB:
Activity Spreadsheet -- Enzyme Inhibition Constant Data from BindingDB
Found 1 hit for monomerid = 309434
TargetMu-type opioid receptor(Homo sapiens (Human))
Purdue Pharma
US Patent
LigandPNGBDBM309434((2R,3aS,4R,9bS)-12-(cyclopropylmethyl)- N-(4-fluor...)
Affinity DataEC50: >2.00E+4nM. Assay description: δ-Opioid Receptor Binding Assay Procedures: δ-Opioid Receptor Binding Assay Procedures were conducted as follows. Radioligand dose-displace...
Ligand InfoPC cidPC sid
In DepthDetails US Patent