BDBM309491 US9603833, Example 113
SMILES CC(=O)N1CCN(CC1)c1ccc(CCc2ccc(COC(=O)NN)cc2F)nc1
InChI Key InChIKey=DVIOLYYKMWVZQC-UHFFFAOYSA-N
Data  2 IC50
  Tab Delimited (TSV)   2D SDfile   Computed 3D by Vconf -m prep SDfile
Find this compound or compounds like it in BindingDB:
Activity Spreadsheet -- Enzyme Inhibition Constant Data from BindingDB
Found 2 hits for monomerid = 309491
TargetMembrane primary amine oxidase(Rattus norvegicus (Rat))
R-Tech Ueno
US Patent
LigandPNGBDBM309491(US9603833, Example 113)
Affinity DataIC50:  0.700nM. Assay description: The compounds of the present invention obtained in Production Examples were examined for the inhibitory effect on human and rat VAP-1 enzyme (SSAO) b...
Ligand InfoPC cidPC sid
In DepthDetails US Patent
TargetMembrane primary amine oxidase(Homo sapiens (Human))
R-Tech Ueno
US Patent
LigandPNGBDBM309491(US9603833, Example 113)
Affinity DataIC50:  0.900nM. Assay description: The compounds of the present invention obtained in Production Examples were examined for the inhibitory effect on human and rat VAP-1 enzyme (SSAO) b...
Ligand InfoPC cidPC sid
In DepthDetails US Patent