BDBM309502 5-chloro-N-{4,5-dichloro-2-[(2-thienylsulfonyl)amino]phenyl}thiophene-2-sulfonamide::US9603834, 1
SMILES Clc1cc(NS(=O)(=O)c2ccco2)c(NS(=O)(=O)c2cccs2)cc1Cl
InChI Key InChIKey=IWKMKEXKTCBKBU-UHFFFAOYSA-N
Data  1 IC50
  Tab Delimited (TSV)   2D SDfile   Computed 3D by Vconf -m prep SDfile
Find this compound or compounds like it in BindingDB:
Activity Spreadsheet -- Enzyme Inhibition Constant Data from BindingDB
Found 1 hit for monomerid = 309502
TargetC-C chemokine receptor type 2(Homo sapiens (Human))
Allergan
US Patent
LigandPNGBDBM309502(5-chloro-N-{4,5-dichloro-2-[(2-thienylsulfonyl)ami...)
Affinity DataIC50:  263nM. Assay description: HEK-Gqi5 cells stably expressing CCR2 were cultured in (DMEM high glucose, 10% FBS, 1% PSA, 400 μg/ml geneticin and 50 μg/ml hygromycin. Ap...
Ligand InfoPC cidPC sid
In DepthDetails US Patent