BDBM309514 N-(5-chloro-2-{[(2,6-dichlorophenyl)sulfonyl]amino}phenyl)-1-benzofuran-2-sulfonamide::US9603834, 13
SMILES Clc1ccc(NS(=O)(=O)c2c(Cl)cccc2Cl)c(NS(=O)(=O)c2cc3ccccc3o2)c1
InChI Key InChIKey=CXPZTNPITZJJMO-UHFFFAOYSA-N
Data  1 IC50
  Tab Delimited (TSV)   2D SDfile   Computed 3D by Vconf -m prep SDfile
Find this compound or compounds like it in BindingDB:
Activity Spreadsheet -- Enzyme Inhibition Constant Data from BindingDB
Found 1 hit for monomerid = 309514
TargetC-C chemokine receptor type 2(Homo sapiens (Human))
Allergan
US Patent
LigandPNGBDBM309514(N-(5-chloro-2-{[(2,6-dichlorophenyl)sulfonyl]amino...)
Affinity DataIC50:  478nM. Assay description: HEK-Gqi5 cells stably expressing CCR2 were cultured in (DMEM high glucose, 10% FBS, 1% PSA, 400 μg/ml geneticin and 50 μg/ml hygromycin. Ap...
Ligand InfoPC cidPC sid
In DepthDetails US Patent