BDBM30961 3-methyl-6-(4-pyridin-2-ylpiperazin-1-yl)sulfonyl-1,3-benzoxazol-2-one::3-methyl-6-[4-(2-pyridyl)piperazino]sulfonyl-1,3-benzoxazol-2-one::3-methyl-6-[[4-(2-pyridinyl)-1-piperazinyl]sulfonyl]-1,3-benzoxazol-2-one::MLS000117427::SMR000094376::cid_4971246
SMILES Cn1c2ccc(cc2oc1=O)S(=O)(=O)N1CCN(CC1)c1ccccn1
InChI Key InChIKey=VMIFATGCFKOGOC-UHFFFAOYSA-N
Data  1 EC50
  Tab Delimited (TSV)   2D SDfile   Computed 3D by Vconf -m prep SDfile
Find this compound or compounds like it in BindingDB:
Activity Spreadsheet -- Enzyme Inhibition Constant Data from BindingDB
Found 1 hit for monomerid = 30961
Target5-hydroxytryptamine receptor 1A(Homo sapiens (Human))
The Scripps Research Institute Molecular Screening Center
Curated by PubChem BioAssay
LigandPNGBDBM30961(3-methyl-6-(4-pyridin-2-ylpiperazin-1-yl)sulfonyl-...)
Affinity DataEC50:  9.90E+4nMpH: 7.4 T: 2°C. Assay description: A cell line containing the human 5-HT1a receptor, the promiscuous G-alpha-15 protein (Ga15) as well as the beta-lactamase (BLA) reporter-gene under c...
In DepthDetails PCBioAssay