BDBM309909 1-(1H- benzo[d]imidazol-5- yl)-3-(4- bromophenyl)thio- urea::US9656991, 23
SMILES Brc1ccc(NC(=S)Nc2ccc3[nH]cnc3c2)cc1
InChI Key InChIKey=MEAUCDLOUYRETL-UHFFFAOYSA-N
Data  1 KI  1 IC50
  Tab Delimited (TSV)   2D SDfile   Computed 3D by Vconf -m prep SDfile
Find this compound or compounds like it in BindingDB:
Activity Spreadsheet -- Enzyme Inhibition Constant Data from BindingDB
Found 2 hits for monomerid = 309909
TargetGlutaminyl-peptide cyclotransferase(Homo sapiens (Human))
Probiodrug
US Patent
LigandPNGBDBM309909(1-(1H- benzo[d]imidazol-5- yl)-3-(4- bromophenyl)t...)
Affinity DataKi:  5.17E+3nM. Assay description: This novel assay was used to determine the kinetic parameters for most of the QC substrates. QC activity was analyzed spectrophotometrically using a ...
Ligand InfoPC cidPC sid
In DepthDetails US Patent
TargetGlutaminyl-peptide cyclotransferase(Homo sapiens (Human))
Probiodrug
US Patent
LigandPNGBDBM309909(1-(1H- benzo[d]imidazol-5- yl)-3-(4- bromophenyl)t...)
Affinity DataIC50:  5.93E+4nM. Assay description: This novel assay was used to determine the kinetic parameters for most of the QC substrates. QC activity was analyzed spectrophotometrically using a ...
Ligand InfoPC cidPC sid
In DepthDetails US Patent