BDBM309914 1-(1H- benzo[d]imidazol-5- yl)-3-(2,4- dimethoxyphenyl)thio- urea::US9656991, 28
SMILES COc1ccc(NC(=S)Nc2ccc3[nH]cnc3c2)c(OC)c1
InChI Key InChIKey=QRIHHWOOTBRDLE-UHFFFAOYSA-N
Data  1 KI  1 IC50
  Tab Delimited (TSV)   2D SDfile   Computed 3D by Vconf -m prep SDfile
Find this compound or compounds like it in BindingDB:
Activity Spreadsheet -- Enzyme Inhibition Constant Data from BindingDB
Found 2 hits for monomerid = 309914
TargetGlutaminyl-peptide cyclotransferase(Homo sapiens (Human))
Probiodrug
US Patent
LigandPNGBDBM309914(1-(1H- benzo[d]imidazol-5- yl)-3-(2,4- dimethoxyph...)
Affinity DataKi:  2.19E+3nM. Assay description: This novel assay was used to determine the kinetic parameters for most of the QC substrates. QC activity was analyzed spectrophotometrically using a ...
Ligand InfoPC cidPC sid
In DepthDetails US Patent
TargetGlutaminyl-peptide cyclotransferase(Homo sapiens (Human))
Probiodrug
US Patent
LigandPNGBDBM309914(1-(1H- benzo[d]imidazol-5- yl)-3-(2,4- dimethoxyph...)
Affinity DataIC50:  1.88E+4nM. Assay description: This novel assay was used to determine the kinetic parameters for most of the QC substrates. QC activity was analyzed spectrophotometrically using a ...
Ligand InfoPC cidPC sid
In DepthDetails US Patent