BDBM309932 1-(1H-benzo[d]- imidazol-5-yl)-3- ((pyridin-2- yl)methyl)-thiourea::US9656991, 46
SMILES S=C(NCc1ccccn1)Nc1ccc2[nH]cnc2c1
InChI Key InChIKey=ANWPWXBSYOVVBP-UHFFFAOYSA-N
Data  1 KI  1 IC50
  Tab Delimited (TSV)   2D SDfile   Computed 3D by Vconf -m prep SDfile
Find this compound or compounds like it in BindingDB:
Activity Spreadsheet -- Enzyme Inhibition Constant Data from BindingDB
Found 2 hits for monomerid = 309932
TargetGlutaminyl-peptide cyclotransferase(Homo sapiens (Human))
Probiodrug
US Patent
LigandPNGBDBM309932(1-(1H-benzo[d]- imidazol-5-yl)-3- ((pyridin-2- yl)...)
Affinity DataKi:  5.37E+3nM. Assay description: This novel assay was used to determine the kinetic parameters for most of the QC substrates. QC activity was analyzed spectrophotometrically using a ...
Ligand InfoPC cidPC sid
In DepthDetails US Patent
TargetGlutaminyl-peptide cyclotransferase(Homo sapiens (Human))
Probiodrug
US Patent
LigandPNGBDBM309932(1-(1H-benzo[d]- imidazol-5-yl)-3- ((pyridin-2- yl)...)
Affinity DataIC50:  4.69E+4nM. Assay description: This novel assay was used to determine the kinetic parameters for most of the QC substrates. QC activity was analyzed spectrophotometrically using a ...
Ligand InfoPC cidPC sid
In DepthDetails US Patent