BDBM309951 1-(4-fluorobenzyl)-3- (1H- benzo[d]imidazol-5- yl)-1-methylthiourea::US9656991, 65
SMILES CN(Cc1ccc(F)cc1)C(=S)Nc1ccc2[nH]cnc2c1
InChI Key InChIKey=UVWMHCZERPIRKA-UHFFFAOYSA-N
Data  1 IC50
  Tab Delimited (TSV)   2D SDfile   Computed 3D by Vconf -m prep SDfile
Find this compound or compounds like it in BindingDB:
Activity Spreadsheet -- Enzyme Inhibition Constant Data from BindingDB
Found 1 hit for monomerid = 309951
TargetGlutaminyl-peptide cyclotransferase(Homo sapiens (Human))
Probiodrug
US Patent
LigandPNGBDBM309951(1-(4-fluorobenzyl)-3- (1H- benzo[d]imidazol-5- yl)...)
Affinity DataIC50:  4.04E+5nM. Assay description: This novel assay was used to determine the kinetic parameters for most of the QC substrates. QC activity was analyzed spectrophotometrically using a ...
Ligand InfoPC cidPC sid
In DepthDetails US Patent