BDBM309961 US9656996, Compound 16
SMILES COc1ncc(cc1NS(C)(=O)=O)-c1nc(N2CCOCC2)c2sc(C)c(CN3CCC(CC3)N(C)C(C)C)c2n1
InChI Key InChIKey=JESRBLDBIYGAIS-UHFFFAOYSA-N
Data  1 IC50
  Tab Delimited (TSV)   2D SDfile   Computed 3D by Vconf -m prep SDfile
Find this compound or compounds like it in BindingDB:
Activity Spreadsheet -- Enzyme Inhibition Constant Data from BindingDB
Found 1 hit for monomerid = 309961
TargetTumor necrosis factor(Homo sapiens (Human))
Shanghai Yingli Pharmaceutical
US Patent
LigandPNGBDBM309961(US9656996, Compound 16)
Affinity DataIC50:  20.1nM. Assay description: 1. Buffer preparation: 50 mM HEPES, pH 7.5, 3 mM MgCl2, 1 mM EGTA, 100 mM NaCl, 0.03% CHAPS.2. The compound was formulated in 100% DMSO in a concentr...
Ligand InfoPC cidPC sid
In DepthDetails US Patent