BDBM309964 US9656996, Compound 27
SMILES COc1ncc(cc1NS(C)(=O)=O)-c1nc(nc2c(CN3CC(C3)C(C)(C)O)cc(F)cc12)N1CCOCC1
InChI Key InChIKey=CVGYYXCSUCWRGV-UHFFFAOYSA-N
Data  1 IC50
  Tab Delimited (TSV)   2D SDfile   Computed 3D by Vconf -m prep SDfile
Find this compound or compounds like it in BindingDB:
Activity Spreadsheet -- Enzyme Inhibition Constant Data from BindingDB
Found 1 hit for monomerid = 309964
TargetTumor necrosis factor(Homo sapiens (Human))
Shanghai Yingli Pharmaceutical
US Patent
LigandPNGBDBM309964(US9656996, Compound 27)
Affinity DataIC50:  230nM. Assay description: 1. Buffer preparation: 50 mM HEPES, pH 7.5, 3 mM MgCl2, 1 mM EGTA, 100 mM NaCl, 0.03% CHAPS.2. The compound was formulated in 100% DMSO in a concentr...
Ligand InfoPC cidPC sid
In DepthDetails US Patent