BDBM309987 N-((S)-1-(3-(3-chloro-4-cyano-2-methylphenyl)-1H-pyrazol-1-yl)propan-2-yl)-2-(1-hydroxyethyl)thiazole-4-carboxamide::US9657003, 186
SMILES C[C@@H](Cn1ccc(n1)-c1ccc(C#N)c(Cl)c1C)NC(=O)c1csc(n1)C(C)O
InChI Key InChIKey=ICFVJJDWCCMHPP-AMGKYWFPSA-N
Data  1 KI  1 IC50
  Tab Delimited (TSV)   2D SDfile   Computed 3D by Vconf -m prep SDfile
Find this compound or compounds like it in BindingDB:
Activity Spreadsheet -- Enzyme Inhibition Constant Data from BindingDB
Found 2 hits for monomerid = 309987
TargetAndrogen receptor(Homo sapiens (Human))
Orion
US Patent
LigandPNGBDBM309987(N-((S)-1-(3-(3-chloro-4-cyano-2-methylphenyl)-1H-p...)
Affinity DataKi:  3nM. Assay description: Androgen receptor (AR) binding affinities of test compounds were studied in cytosolic lysates obtained from ventral prostates of castrated rats by co...
Ligand InfoPC cidPC sid
In DepthDetails US Patent
TargetAndrogen receptor(Homo sapiens (Human))
Orion
US Patent
LigandPNGBDBM309987(N-((S)-1-(3-(3-chloro-4-cyano-2-methylphenyl)-1H-p...)
Affinity DataIC50:  11nM. Assay description: Androgen receptor (AR) binding affinities of test compounds were studied in cytosolic lysates obtained from ventral prostates of castrated rats by co...
Ligand InfoPC cidPC sid
In DepthDetails US Patent