BDBM310012 US9657015, Example 6
SMILES CN1[C@@H](C2=C(CCNC2=O)N(C1=O)c1cccc(c1)C(F)(F)F)c1ccc(cc1)C#N
InChI Key InChIKey=BECKTRZUIJIPFD-LJQANCHMSA-N
Data  1 IC50
  Tab Delimited (TSV)   2D SDfile   Computed 3D by Vconf -m prep SDfile
Find this compound or compounds like it in BindingDB:
Activity Spreadsheet -- Enzyme Inhibition Constant Data from BindingDB
Found 1 hit for monomerid = 310012
TargetNeutrophil elastase(Homo sapiens (Human))
Boehringer Ingelheim International
US Patent
LigandPNGBDBM310012(US9657015, Example 6)
Affinity DataIC50: <1nM. Assay description: Materials: Human neutrophil elastase was purchased from Calbiochem (Cat. No.: 324681) and the elastase substrate MeOSuc-Ala-Ala-Pro-Val-AMC from Bach...
Ligand InfoPC cidPC sid
In DepthDetails US Patent