BDBM310021 6-((2-(Cyclopropylamino)-4-pyrimidinyl)amino)-N-((2R)-2-fluoro-3-hydroxy-3-methylbutyl)-4-(isopropylamino)nicotinamide::US10544133, Example 24::US9657009, 24
SMILES CC(C)Nc1cc(Nc2ccnc(NC3CC3)n2)ncc1C(=O)NC[C@@H](F)C(C)(C)O
InChI Key InChIKey=ATIDAUNEHFRIQB-MRXNPFEDSA-N
Data  2 IC50
  Tab Delimited (TSV)   2D SDfile   Computed 3D by Vconf -m prep SDfile
Find this compound or compounds like it in BindingDB:
Activity Spreadsheet -- Enzyme Inhibition Constant Data from BindingDB
Found 2 hits for monomerid = 310021
TargetInterleukin-1 receptor-associated kinase 4(Homo sapiens (Human))
Bristol-Myers Squibb
US Patent
LigandPNGBDBM310021(6-((2-(Cyclopropylamino)-4-pyrimidinyl)amino)-N-((...)
Affinity DataIC50:  11nM. Assay description: The assays were performed in U-bottom 384-well plates. The final assay volume was 30 μL prepared from 15 μL additions of enzyme and substra...
Ligand InfoPC cidPC sid
In DepthDetails US Patent
TargetInterleukin-1 receptor-associated kinase 4(Homo sapiens (Human))
Bristol-Myers Squibb
US Patent
LigandPNGBDBM310021(6-((2-(Cyclopropylamino)-4-pyrimidinyl)amino)-N-((...)
Affinity DataIC50:  11nM. Assay description: The assays were performed in U-bottom 384-well plates. The final assay volume was 30 μL prepared from 15 μL additions of enzyme and substra...
Ligand InfoPC cidPC sid
In DepthDetails US Patent