BDBM310105 US10377768, Compound 19::US9657033, Compound 19
SMILES CC1COc2ncc(NC(=O)c3c(Cl)cccc3C(F)(F)F)cc2N1S(=O)(=O)c1ccc(F)cc1
InChI Key InChIKey=LGVOXZAZUPDLAP-UHFFFAOYSA-N
Data  2 EC50
  Tab Delimited (TSV)   2D SDfile   Computed 3D by Vconf -m prep SDfile
Find this compound or compounds like it in BindingDB:
Activity Spreadsheet -- Enzyme Inhibition Constant Data from BindingDB
Found 2 hits for monomerid = 310105
TargetNuclear receptor ROR-gamma(Homo sapiens (Human))
Lycera
US Patent
LigandPNGBDBM310105(US10377768, Compound 19 | US9657033, Compound 19)
Affinity DataEC50:  20nM. Assay description: Recombinant, HIS-tagged RORγ-LBD was expressed in SF9 cells using a baculovirus expression system. Cells were lysed and the lysate was used as a...
Ligand InfoPC cidPC sid
In DepthDetails US Patent
TargetNuclear receptor ROR-gamma(Homo sapiens (Human))
Lycera
US Patent
LigandPNGBDBM310105(US10377768, Compound 19 | US9657033, Compound 19)
Affinity DataEC50:  20nM. Assay description: Recombinant,HIS-tagged RORγ-LBD was expressed in SF9 cells using a baculovirus expression system. Cells were lysed and the lysate was used as a ...
Ligand InfoPC cidPC sid
In DepthDetails US Patent