BDBM310129 (R)-methyl (7-(2,6-dichlorobenzamido)-1-(m-tolylsulfonyl)-1,2,3,4-tetrahydro-1,5-naphthyridin-3-yl)carbamate ::US10377768, Compound 42::US9657033, Compound 42
SMILES COC(=O)N[C@H]1CN(c2cc(NC(=O)c3c(Cl)cccc3Cl)cnc2C1)S(=O)(=O)c1cccc(C)c1
InChI Key InChIKey=JKEBHOGWSPWKMK-MRXNPFEDSA-N
Data  2 EC50
  Tab Delimited (TSV)   2D SDfile   Computed 3D by Vconf -m prep SDfile
Find this compound or compounds like it in BindingDB:
Activity Spreadsheet -- Enzyme Inhibition Constant Data from BindingDB
Found 2 hits for monomerid = 310129
TargetNuclear receptor ROR-gamma(Homo sapiens (Human))
Lycera
US Patent
LigandPNGBDBM310129((R)-methyl (7-(2,6-dichlorobenzamido)-1-(m-tolylsu...)
Affinity DataEC50:  25nM. Assay description: HIS-tagged RORγ-LBD protein was expressed in SF9 cells using a baculovirus expression system. The RORγ-LBD protein was purified by glutathi...
Ligand InfoPC cidPC sid
In DepthDetails US Patent
TargetNuclear receptor ROR-gamma(Homo sapiens (Human))
Lycera
US Patent
LigandPNGBDBM310129((R)-methyl (7-(2,6-dichlorobenzamido)-1-(m-tolylsu...)
Affinity DataEC50:  25nM. Assay description: HIS-tagged RORγ-LBD protein was expressed in SF9 cells using a baculovirus expression system. The RORγ-LBD protein was purified by glutathi...
Ligand InfoPC cidPC sid
In DepthDetails US Patent