BDBM310130 US9657033, Compound 43
SMILES CC(=O)NC[C@H]1CN(c2cc(NC(=O)c3c(Cl)cccc3Cl)cnc2O1)S(=O)(=O)c1cccc(c1)C1CC1
InChI Key InChIKey=FDNTZZUHSBYMMN-IBGZPJMESA-N
Data  1 EC50
  Tab Delimited (TSV)   2D SDfile   Computed 3D by Vconf -m prep SDfile
Find this compound or compounds like it in BindingDB:
Activity Spreadsheet -- Enzyme Inhibition Constant Data from BindingDB
Found 1 hit for monomerid = 310130
TargetNuclear receptor ROR-gamma(Homo sapiens (Human))
Lycera
US Patent
LigandPNGBDBM310130(US9657033, Compound 43)
Affinity DataEC50:  24nM. Assay description: HIS-tagged RORγ-LBD protein was expressed in SF9 cells using a baculovirus expression system. The RORγ-LBD protein was purified by glutathi...
Ligand InfoPC cidPC sid
In DepthDetails US Patent