BDBM310138 US10377768, Compound 52::US9657033, Compound 52
SMILES C[C@H](O)C(=O)N[C@@H]1CN(c2cc(NC(=O)c3c(Cl)cccc3Cl)cnc2C1)S(=O)(=O)c1cccc(c1)C(F)(F)F
InChI Key InChIKey=CPIBRDVMPJVWIN-BBRMVZONSA-N
Data  2 EC50
  Tab Delimited (TSV)   2D SDfile   Computed 3D by Vconf -m prep SDfile
Find this compound or compounds like it in BindingDB:
Activity Spreadsheet -- Enzyme Inhibition Constant Data from BindingDB
Found 2 hits for monomerid = 310138
TargetNuclear receptor ROR-gamma(Homo sapiens (Human))
Lycera
US Patent
LigandPNGBDBM310138(US10377768, Compound 52 | US9657033, Compound 52)
Affinity DataEC50:  74nM. Assay description: HIS-tagged RORγ-LBD protein was expressed in SF9 cells using a baculovirus expression system. The RORγ-LBD protein was purified by glutathi...
Ligand InfoPC cidPC sid
In DepthDetails US Patent
TargetNuclear receptor ROR-gamma(Homo sapiens (Human))
Lycera
US Patent
LigandPNGBDBM310138(US10377768, Compound 52 | US9657033, Compound 52)
Affinity DataEC50:  74nM. Assay description: HIS-tagged RORγ-LBD protein was expressed in SF9 cells using a baculovirus expression system. The RORγ-LBD protein was purified by glutathi...
Ligand InfoPC cidPC sid
In DepthDetails US Patent