BDBM310171 US10377768, Compound 84::US9657033, Compound 84
SMILES Fc1cccc(Cl)c1C(=O)Nc1cnc2C[C@H](CN(c2c1)S(=O)(=O)c1cccc(c1)C(F)(F)F)N1CCCC1=O
InChI Key InChIKey=SGYVYTOHRYJPPM-QGZVFWFLSA-N
Data  2 EC50
  Tab Delimited (TSV)   2D SDfile   Computed 3D by Vconf -m prep SDfile
Find this compound or compounds like it in BindingDB:
Activity Spreadsheet -- Enzyme Inhibition Constant Data from BindingDB
Found 2 hits for monomerid = 310171
TargetNuclear receptor ROR-gamma(Homo sapiens (Human))
Lycera
US Patent
LigandPNGBDBM310171(US10377768, Compound 84 | US9657033, Compound 84)
Affinity DataEC50:  60nM. Assay description: HIS-tagged RORγ-LBD protein was expressed in SF9 cells using a baculovirus expression system. The RORγ-LBD protein was purified by glutathi...
Ligand InfoPC cidPC sid
In DepthDetails US Patent
TargetNuclear receptor ROR-gamma(Homo sapiens (Human))
Lycera
US Patent
LigandPNGBDBM310171(US10377768, Compound 84 | US9657033, Compound 84)
Affinity DataEC50:  60nM. Assay description: HIS-tagged RORγ-LBD protein was expressed in SF9 cells using a baculovirus expression system. The RORγ-LBD protein was purified by glutathi...
Ligand InfoPC cidPC sid
In DepthDetails US Patent