BDBM310191 4-(4-chlorophenyl)-1-(3-(3,4-dihydroisoquinolin-2(1H)-yl)-2-hydroxypropyl)piperazin-2-one::US10150758, Compound 7
SMILES OC(CN1CCc2ccccc2C1)CN1CCN(CC1=O)c1ccc(Cl)cc1
InChI Key InChIKey=JICPZAXECVIGNV-UHFFFAOYSA-N
Data  1 IC50
  Tab Delimited (TSV)   2D SDfile   Computed 3D by Vconf -m prep SDfile
Find this compound or compounds like it in BindingDB:
Activity Spreadsheet -- Enzyme Inhibition Constant Data from BindingDB
Found 1 hit for monomerid = 310191
TargetProtein arginine N-methyltransferase 5(Homo sapiens (Human))
Epizyme
US Patent
LigandPNGBDBM310191(4-(4-chlorophenyl)-1-(3-(3,4-dihydroisoquinolin-2(...)
Affinity DataIC50: <100nM. Assay description: The assays were all performed in a buffer consisting of 20 mM Bicine (pH=7.6), 1 mM TCEP, 0.005% BSG, and 0.002% Tween20, prepared on the day of use....
Ligand InfoPC cidPC sid
In DepthDetails US Patent