BDBM310316 US10150760, Example 112.0::US10150760, Example 113.0
SMILES CO[C@@H]([C@H](C)S(=O)(=O)Nc1nnc([C@H]2CCCCO2)n1C1(C)CC1)c1ncc(Cl)cn1
InChI Key InChIKey=MGEAXSVXDGIFNC-CFVMTHIKSA-N
Data  2 EC50
  Tab Delimited (TSV)   2D SDfile   Computed 3D by Vconf -m prep SDfile
Find this compound or compounds like it in BindingDB:
Activity Spreadsheet -- Enzyme Inhibition Constant Data from BindingDB
Found 2 hits for monomerid = 310316
TargetApelin receptor(Homo sapiens (Human))
Amgen
US Patent
LigandPNGBDBM310316(US10150760, Example 112.0 | US10150760, Example 11...)
Affinity DataEC50:  260nM. Assay description: The human APJ receptor was cloned by polymerase chain reaction and the gene encoding the receptor was subcloned in pFLAG-CMV-3 expression vector (Sig...
Ligand InfoPC cidPC sid
In DepthDetails US Patent
TargetApelin receptor(Homo sapiens (Human))
Amgen
US Patent
LigandPNGBDBM310316(US10150760, Example 112.0 | US10150760, Example 11...)
Affinity DataEC50:  14nM. Assay description: The human APJ receptor was cloned by polymerase chain reaction and the gene encoding the receptor was subcloned in pFLAG-CMV-3 expression vector (Sig...
Ligand InfoPC cidPC sid
In DepthDetails US Patent