BDBM31062 5-methyl-N-(5-quinolinyl)-2-thiophenesulfonamide::5-methyl-N-(5-quinolyl)thiophene-2-sulfonamide::5-methyl-N-quinolin-5-yl-thiophene-2-sulfonamide::5-methyl-N-quinolin-5-ylthiophene-2-sulfonamide::MLS000060442::SMR000067302::cid_2082098
SMILES Cc1ccc(s1)S(=O)(=O)Nc1cccc2ncccc12
InChI Key InChIKey=XSYLVTQRXJCUTP-UHFFFAOYSA-N
Data  7 IC50  4 EC50
  Tab Delimited (TSV)   2D SDfile   Computed 3D by Vconf -m prep SDfile
Find this compound or compounds like it in BindingDB:
Activity Spreadsheet -- Enzyme Inhibition Constant Data from BindingDB
Found 11 hits for monomerid = 31062
Target5-hydroxytryptamine receptor 1A(Homo sapiens (Human))
The Scripps Research Institute Molecular Screening Center
Curated by PubChem BioAssay
LigandPNGBDBM31062(5-methyl-N-(5-quinolinyl)-2-thiophenesulfonamide |...)
Affinity DataIC50:  1.10E+3nMpH: 7.4 T: 2°C. Assay description: A cell line containing the human 5-HT1a receptor, the promiscuous G-alpha-15 protein (Ga15) as well as the beta-lactamase (BLA) reporter-gene under c...
In DepthDetails PCBioAssay
Target5-hydroxytryptamine receptor 1E(Homo sapiens (Human))
The Scripps Research Institute Molecular Screening Center
Curated by PubChem BioAssay
LigandPNGBDBM31062(5-methyl-N-(5-quinolinyl)-2-thiophenesulfonamide |...)
Affinity DataIC50:  2.91E+3nMpH: 7.4 T: 2°C. Assay description: To measure 5-HT1E activity, a Chinese Hamster Ovary (CHO) cell line was developed at the Scripps Molecular Research Institute Screening center. This ...
In DepthDetails PCBioAssay
TargetSphingosine 1-phosphate receptor 1(Homo sapiens (Human))
The Scripps Research Institute Molecular Screening Center
Curated by PubChem BioAssay
LigandPNGBDBM31062(5-methyl-N-(5-quinolinyl)-2-thiophenesulfonamide |...)
Affinity DataEC50:  2.76E+4nM. Assay description: Source (MLSCN Center Name): The Scripps Research Institute Molecular Screening Center Center Affiliation: The Scripps Research Institute, TSRI Assay ...
In DepthDetails PCBioAssay
TargetSphingosine 1-phosphate receptor 1(Homo sapiens (Human))
The Scripps Research Institute Molecular Screening Center
Curated by PubChem BioAssay
LigandPNGBDBM31062(5-methyl-N-(5-quinolinyl)-2-thiophenesulfonamide |...)
Affinity DataEC50: >9.51E+4nM. Assay description: Source (MLSCN Center Name): The Scripps Research Institute Molecular Screening Center Center Affiliation: The Scripps Research Institute, TSRI Assay ...
In DepthDetails PCBioAssay
TargetSphingosine 1-phosphate receptor 1(Homo sapiens (Human))
The Scripps Research Institute Molecular Screening Center
Curated by PubChem BioAssay
LigandPNGBDBM31062(5-methyl-N-(5-quinolinyl)-2-thiophenesulfonamide |...)
Affinity DataEC50:  9.62E+3nM. Assay description: Source (MLSCN Center Name): The Scripps Research Institute Molecular Screening Center Center Affiliation: The Scripps Research Institute, TSRI Assay ...
In DepthDetails PCBioAssay
TargetHeat shock factor protein 1(Mus musculus)
Broad Institute
Curated by PubChem BioAssay
LigandPNGBDBM31062(5-methyl-N-(5-quinolinyl)-2-thiophenesulfonamide |...)
Affinity DataEC50:  3.91E+3nM. Assay description: Keywords: Heat Shock Factor-1 (HSF-1), Stress Response, MG132, NIH3T3, Luminescence Assay Overview: Confirmation testing of small molecules identifie...
In DepthDetails PCBioAssay
TargetIsoform 2 of Nuclear receptor ROR-alpha (Alpha-2)(Homo sapiens (Human))
The Scripps Research Institute Molecular Screening Center
Curated by PubChem BioAssay
LigandPNGBDBM31062(5-methyl-N-(5-quinolinyl)-2-thiophenesulfonamide |...)
Affinity DataIC50:  4.03E+3nM. Assay description: Source (MLSCN Center Name): The Scripps Research Institute Molecular Screening Center Center Affiliation: The Scripps Research Institute, TSRI Assay ...
In DepthDetails PCBioAssay
TargetSteroidogenic factor 1(Homo sapiens (Human))
The Scripps Research Institute Molecular Screening Center
Curated by PubChem BioAssay
LigandPNGBDBM31062(5-methyl-N-(5-quinolinyl)-2-thiophenesulfonamide |...)
Affinity DataIC50:  5.33E+3nM. Assay description: Source (MLSCN Center Name): The Scripps Research Institute Molecular Screening Center Center Affiliation: The Scripps Research Institute, TSRI Assay ...
In DepthDetails PCBioAssay
TargetIsoform 2 of Nuclear receptor ROR-alpha (Alpha-2)(Homo sapiens (Human))
The Scripps Research Institute Molecular Screening Center
Curated by PubChem BioAssay
LigandPNGBDBM31062(5-methyl-N-(5-quinolinyl)-2-thiophenesulfonamide |...)
Affinity DataIC50:  6.89E+3nM. Assay description: Source (MLSCN Center Name): The Scripps Research Institute Molecular Screening Center Center Affiliation: The Scripps Research Institute, TSRI Assay ...
In DepthDetails PCBioAssay
TargetSteroidogenic factor 1(Homo sapiens (Human))
The Scripps Research Institute Molecular Screening Center
Curated by PubChem BioAssay
LigandPNGBDBM31062(5-methyl-N-(5-quinolinyl)-2-thiophenesulfonamide |...)
Affinity DataIC50:  5.75E+3nM. Assay description: Source (MLSCN Center Name): The Scripps Research Institute Molecular Screening Center Center Affiliation: The Scripps Research Institute, TSRI Assay ...
In DepthDetails PCBioAssay
TargetSphingosine 1-phosphate receptor 3(Homo sapiens (Human))
The Scripps Research Institute Molecular Screening Center
Curated by PubChem BioAssay
LigandPNGBDBM31062(5-methyl-N-(5-quinolinyl)-2-thiophenesulfonamide |...)
Affinity DataIC50: >3.90E+4nM. Assay description: External Assay ID: S1P3_IC50_CS_5H1E_Antagonists Name: S1P3 Dose Response Assay Counterscreen for 5-Hydroxytryptamine(Serotonin) Receptor Subtype 1E ...
In DepthDetails PCBioAssay