BDBM310689 (S)-5-(6-(1,1,1,3,3,3-Hexafluoro-2-hydroxypropan-2-yl)-4-methylpyridin-3-yl)-N-(2-hydroxy-2-methylpropyl)-4-(2-methylpyrrolidine-1-carbonyl)thiazole-2-carboxamide::US10150762, Example 18/3
SMILES C[C@H]1CCCN1C(=O)c1nc(sc1-c1cnc(cc1C)C(O)(C(F)(F)F)C(F)(F)F)C(=O)NCC(C)(C)O
InChI Key InChIKey=IYTFCJYRDOUCJG-LBPRGKRZSA-N
Data  1 IC50  1 Kd
  Tab Delimited (TSV)   2D SDfile   Computed 3D by Vconf -m prep SDfile
Find this compound or compounds like it in BindingDB:
Activity Spreadsheet -- Enzyme Inhibition Constant Data from BindingDB
Found 2 hits for monomerid = 310689
TargetNuclear receptor ROR-gamma(Homo sapiens (Human))
Janssen Pharmaceutica
US Patent
LigandPNGBDBM310689((S)-5-(6-(1,1,1,3,3,3-Hexafluoro-2-hydroxypropan-2...)
Affinity DataIC50:  730nM. Assay description: Cells used in this assay were transiently co-transfected with three different plasmids, one expressing the GAL4-DNA binding domain (DBD)-RORγt f...
Ligand InfoPC cidPC sid
In DepthDetails US Patent
TargetNuclear receptor ROR-gamma(Homo sapiens (Human))
Janssen Pharmaceutica
US Patent
LigandPNGBDBM310689((S)-5-(6-(1,1,1,3,3,3-Hexafluoro-2-hydroxypropan-2...)
Affinity DataKd:  230nM. Assay description: Project compounds were arranged in a pre-dosed mother plate (Greiner Bio-one) wherein compounds are serially diluted in 100% DMSO by 1:2 from a high ...
Ligand InfoPC cidPC sid
In DepthDetails US Patent