BDBM31070 1-(4-methoxyphenyl)-3-(4-pyridylmethylamino)pyrrolidine-2,5-quinone::1-(4-methoxyphenyl)-3-(pyridin-4-ylmethylamino)pyrrolidine-2,5-dione::1-(4-methoxyphenyl)-3-[(4-pyridinylmethyl)amino]-2,5-pyrrolidinedione::MLS000099014::SMR000070427::cid_2877659
SMILES COc1ccc(cc1)-n1c(O)cc(NCc2ccncc2)c1O
InChI Key InChIKey=MAFHGZDSCIQJNB-UHFFFAOYSA-N
Data  3 IC50
  Tab Delimited (TSV)   2D SDfile   Computed 3D by Vconf -m prep SDfile
Find this compound or compounds like it in BindingDB:
Activity Spreadsheet -- Enzyme Inhibition Constant Data from BindingDB
Found 3 hits for monomerid = 31070
Target5-hydroxytryptamine receptor 1A(Homo sapiens (Human))
The Scripps Research Institute Molecular Screening Center
Curated by PubChem BioAssay
LigandPNGBDBM31070(1-(4-methoxyphenyl)-3-(4-pyridylmethylamino)pyrrol...)
Affinity DataIC50:  4.00E+4nMpH: 7.4 T: 2°C. Assay description: A cell line containing the human 5-HT1a receptor, the promiscuous G-alpha-15 protein (Ga15) as well as the beta-lactamase (BLA) reporter-gene under c...
Ligand InfoPC cidPC sid
In DepthDetails PCBioAssay
TargetSphingosine 1-phosphate receptor 3(Homo sapiens (Human))
The Scripps Research Institute Molecular Screening Center
Curated by PubChem BioAssay
LigandPNGBDBM31070(1-(4-methoxyphenyl)-3-(4-pyridylmethylamino)pyrrol...)
Affinity DataIC50: >5.00E+4nM. Assay description: External Assay ID: S1P3_IC50_CS_5H1E_Antagonists Name: S1P3 Dose Response Assay Counterscreen for 5-Hydroxytryptamine(Serotonin) Receptor Subtype 1E ...
Ligand InfoPC cidPC sid
In DepthDetails PCBioAssay
Target5-hydroxytryptamine receptor 1E(Homo sapiens (Human))
The Scripps Research Institute Molecular Screening Center
Curated by PubChem BioAssay
LigandPNGBDBM31070(1-(4-methoxyphenyl)-3-(4-pyridylmethylamino)pyrrol...)
Affinity DataIC50:  5.00E+4nMpH: 7.4 T: 2°C. Assay description: To measure 5-HT1E activity, a Chinese Hamster Ovary (CHO) cell line was developed at the Scripps Molecular Research Institute Screening center. This ...
Ligand InfoPC cidPC sid
In DepthDetails PCBioAssay