BDBM310779 US10150764, Compound 65
SMILES CCN([C@H]1CC[C@@H](CC1)N(C)CCOC)c1cc(Cl)cc(C(=O)NCc2c(C)n(CC)[nH]c2=O)c1C
InChI Key
Data  2 IC50
  Tab Delimited (TSV)   2D SDfile   Computed 3D by Vconf -m prep SDfile
Find this compound or compounds like it in BindingDB:
Activity Spreadsheet -- Enzyme Inhibition Constant Data from BindingDB
Found 2 hits for monomerid = 310779
TargetHistone-lysine N-methyltransferase EZH2 [Y641F](Homo sapiens (Human))
Epizyme
US Patent
LigandPNGBDBM310779(US10150764, Compound 65)
Affinity DataIC50:  442nM. Assay description: The assays were performed in a buffer consisting of 20 mM bicine (pH=7.6), 0.5 mM DTT, 0.005% BSG, 100 mM KCl and 0.002% Tween20, prepared on the day...
Ligand InfoPC cidPC sid
In DepthDetails US Patent
TargetHistone-lysine N-methyltransferase EZH2(Homo sapiens (Human))
Epizyme
US Patent
LigandPNGBDBM310779(US10150764, Compound 65)
Affinity DataIC50:  1.14E+3nM. Assay description: The assays were performed in a buffer consisting of 20 mM bicine (pH=7.6), 0.5 mM DTT, 0.005% BSG, 100 mM KCl and 0.002% Tween20, prepared on the day...
Ligand InfoPC cidPC sid
In DepthDetails US Patent