BDBM310858 US10150766, Example 52
SMILES Cc1nc2[C@H]3CCC[C@@H](Cc2c(n1)-c1ccc(F)cc1)N3C(=O)c1ccnc(c1Cl)C(F)(F)F
InChI Key InChIKey=IPDSCGIWOUCIMU-MAUKXSAKSA-N
Data  1 KI  1 IC50
  Tab Delimited (TSV)   2D SDfile   Computed 3D by Vconf -m prep SDfile
Find this compound or compounds like it in BindingDB:
Activity Spreadsheet -- Enzyme Inhibition Constant Data from BindingDB
Found 2 hits for monomerid = 310858
TargetP2X purinoceptor 7(Homo sapiens (Human))
Janssen Pharmaceutica
US Patent
LigandPNGBDBM310858(US10150766, Example 52)
Affinity DataKi:  60.3nM. Assay description: human or rat P2X7-1321N1 cells were collected and frozen @ −80° C. On the day of the experiment, cell membrane preparations were made according...
Ligand InfoPC cidPC sid
In DepthDetails US Patent
TargetP2X purinoceptor 7(Rattus norvegicus (Rat))
Janssen Pharmaceutica
US Patent
LigandPNGBDBM310858(US10150766, Example 52)
Affinity DataIC50:  81.8nM. Assay description: human or rat P2X7-1321N1 cells were collected and frozen @ −80° C. On the day of the experiment, cell membrane preparations were made according...
Ligand InfoPC cidPC sid
In DepthDetails US Patent