BDBM310881 3-(6-methyl-7-oxo-1H-pyrrolo[2,3-c]pyridin-4-yl)benzamide::US10150767, Example 21
SMILES Cn1cc(-c2cccc(c2)C(N)=O)c2cc[nH]c2c1=O
InChI Key InChIKey=ZHSINCQZRRZNPK-UHFFFAOYSA-N
Data  1 IC50
  Tab Delimited (TSV)   2D SDfile   Computed 3D by Vconf -m prep SDfile
Find this compound or compounds like it in BindingDB:
Activity Spreadsheet -- Enzyme Inhibition Constant Data from BindingDB
Found 1 hit for monomerid = 310881
TargetBromodomain-containing protein 4 [42-168](Homo sapiens (Human))
Genentech
US Patent
LigandPNGBDBM310881(3-(6-methyl-7-oxo-1H-pyrrolo[2,3-c]pyridin-4-yl)be...)
Affinity DataIC50:  180nM. Assay description: His/Flag epitope tagged BRD4 BD142-168 was cloned, expressed, and purified to. BRD4 binding and inhibition was assessed by monitoring the engagement ...
Ligand InfoPC cidPC sid
In DepthDetails US Patent