BDBM310915 N-benzyl-4-(6-methyl-7-oxo-1H-pyrrolo[2,3-c]pyridin-4-yl)benzamide::US10150767, Example 37
SMILES Cn1cc(-c2cccc(c2)C(=O)NCc2ccccc2)c2cc[nH]c2c1=O
InChI Key InChIKey=IKUUMECYRJEQDB-UHFFFAOYSA-N
Data  1 IC50
  Tab Delimited (TSV)   2D SDfile   Computed 3D by Vconf -m prep SDfile
Find this compound or compounds like it in BindingDB:
Activity Spreadsheet -- Enzyme Inhibition Constant Data from BindingDB
Found 1 hit for monomerid = 310915
TargetTranscription initiation factor TFIID subunit 1 [1504-1635](Homo sapiens (Human))
Genentech
US Patent
LigandPNGBDBM310915(N-benzyl-4-(6-methyl-7-oxo-1H-pyrrolo[2,3-c]pyridi...)
Affinity DataIC50:  63nM. Assay description: His/Flag epitope tagged TAF1-BD21504-1635 was cloned, expressed, and purified to homogeneity. TAF1-BD2 binding and inhibition was assessed by monitor...
Ligand InfoPC cidPC sid
In DepthDetails US Patent